Far East
preferred label: Ferner Osten @de
wikipedia article: Ferner Osten
wikipedia article: Far East
type: Concept
NotationLong: B 009
scope note: Benutzt für Südostasien und Ostasien @de
broader: Asia
subject of: about
in scheme: geo
wa folder count: 1
notation: B9
note: waFolderCount: 1
gnd identifier: 4016795-1

NotationLong
sub property of: notation
definition: EXPERIMENTAL: Notation with blanks and leading zeros for sortability.

Asia
notation: B1
label: Asien @de
type: Concept
narrower: Far East