NotationLong
sub property of: notation
definition: EXPERIMENTAL: Notation with blanks and leading zeros for sortability.

Central Asia
preferred label: Zentralasien @de
NotationLong: B 005
gnd identifier: 4079487-8
type: Concept
scope note: Benutzt für Innerasien, Gebiet der abflusslosen Hochländer im Inneren Asiens, die im N von den Randgebirgen Südsibiriens, im O vom Grossen Chingan, im S von Karakorum und Transhimalaya und im W vom Pamir umschlossen werden; umfaßt d. Hochland von Tibet, Tarimbecken, d. Beckenlandschaft d. Dsungarei, d.h. W- u. N-China u. Mongolei @de
notation: B5
wikipedia article: Central Asia
wikipedia article: Zentralasien
subject of: about
broader: Asia
in scheme: geo

Asia
notation: B1
label: Asien @de
type: Concept
narrower: Central Asia