NotationLong
sub property of: notation
definition: EXPERIMENTAL: Notation with blanks and leading zeros for sortability.

Ottoman Empire
notation: A43
sh folder count: 135
gnd identifier: 4075720-1
gnd identifier: 4061163-2
label: Osmanisches Reich (-1923) @de
subject of: about
folders complete: Y
wikipedia article: Osmanisches Reich
wikipedia article: Ottoman Empire
wa folder count: 9
note: shFolderCount: 135
note: waFolderCount: 9
NotationLong: A 043 (alt)
type: Concept
in scheme: geo
broader: Asia
scope note: Ab 1923 für Türkei nur B 021 verwenden! @de

Asia
notation: B1
label: Asien @de
type: Concept
narrower: Ottoman Empire