Southeastern Europe
geo category type: B
NotationLong: A 006
note: waFolderCount: 5
note: shFolderCount: 190
folders complete: Y
sh folder count: 190
notation: A6
gnd identifier: 4058449-5
wikipedia article: Southeast Europe
wikipedia article: Südosteuropa
scope note: (einschl.: Balkan, Balitkum, Albanien, Bulgarien, Griechenland, Makedonien, Rumänien, Europäische Türkei, ehem. Jugoslawien, außer Slowenien)Umfasst die Südosteuropäische Halbinsel @de
subject of: about
label: Südosteuropa @de
in scheme: geo
wa folder count: 5
type: Concept
narrower: Dalmatia
broader: Europe

Europe
notation: A1
label: Europa @de
type: Concept
narrower: Southeastern Europe

NotationLong
sub property of: notation
definition: EXPERIMENTAL: Notation with blanks and leading zeros for sortability.

Dalmatia
notation: A40g(A35)
label: Dalmatien @de
type: Concept
broader: Southeastern Europe