NotationLong
sub property of: notation
definition: EXPERIMENTAL: Notation with blanks and leading zeros for sortability.

Central Europe
wikipedia article: Mitteleuropa
wikipedia article: Central Europe
in scheme: geo
type: Concept
notation: A2
preferred label: Mitteleuropa @de
gnd identifier: 4039677-0
note: shFolderCount: 20
note: waFolderCount: 4
scope note: (einschl.: Donauraum. Deutschland, Österreich, Polen, Schweiz, Slowakei, Slowenien, Tschechische Republik, Kroatien und Ungarn) @de
geo category type: A
broader: Europe
sh folder count: 20
folders complete: Y
NotationLong: A 002
subject of: about
wa folder count: 4

Europe
notation: A1
label: Europa @de
type: Concept
narrower: Central Europe