NotationLong
sub property of: notation
definition: EXPERIMENTAL: Notation with blanks and leading zeros for sortability.

Asia
notation: B1
label: Asien @de
type: Concept
narrower: Jiaozhou

Jiaozhou
note: waFolderCount: 2
note: shFolderCount: 81
wikipedia article: Kiautschou Bay Leased Territory
wikipedia article: Kiautschou
gnd identifier: 4110253-8
label: Kiautschou @de
wa folder count: 2
sh folder count: 81
scope note: bis 9.12.1922, dann China (B 94). Von 1898 bis 1914 eine deutsche Kolonie mit der Hauptstadt Tsingtau an der Südküste der Provinz Shandong der Volksrepublik China. @de
subject of: about
in scheme: geo
type: Concept
NotationLong: B 103
broader: Asia
folders complete: Y
notation: B103