Australia and Oceania
type: Concept
notation: D1
label: Australien und südpazifischer Inselraum @de
narrower: Japanese South Pacific Mandate

Japanese South Pacific Mandate
type: Concept
wikipedia article: Japanisches Südseemandat
wikipedia article: South Seas Mandate
subject of: about
preferred label: Japanische Mandatländer in Ozeanien @de
gnd identifier: 4122008-0
gnd identifier: 4249309-2
gnd identifier: 4029739-1
gnd identifier: 4044396-6
note: shFolderCount: 43
note: waFolderCount: 1
folders complete: Y
broader: Australia and Oceania
wa folder count: 1
in scheme: geo
sh folder count: 43
NotationLong: D 018
scope note: Marianen, Karolinen Inseln, Nauru, Palau @de
notation: D18

NotationLong
sub property of: notation
definition: EXPERIMENTAL: Notation with blanks and leading zeros for sortability.