Australia and Oceania
type: Concept
notation: D1
label: Australien und südpazifischer Inselraum @de
narrower: Marshall Islands, Nauru

Marshall Islands, Nauru
type: Concept
gnd identifier: 111598-4
gnd identifier: 4037700-3
gnd identifier: 4122008-0
wikipedia article: Nauru
wikipedia article: Marshallinseln
wikipedia article: Marshall Islands
label: Marshall-Inseln, Nauru (bis 30.6.1919) @de
subject of: about
sh folder count: 7
broader: Australia and Oceania
notation: D16
note: shFolderCount: 7
NotationLong: D 016
scope note: Marschall-Inseln, Nauru (bis 30.06.1919, dann unter Japanische Mandatländer in Ozeanien (D 18); Staat im westlichen Pazifik, umfasst die gleichnamige, zum östlichen Mikronesien zählende Inselgruppe @de
in scheme: geo
folders complete: Y

NotationLong
sub property of: notation
definition: EXPERIMENTAL: Notation with blanks and leading zeros for sortability.