Mariana Islands
type: Concept
preferred label: Marianen @de
in scheme: geo
folders complete: Y
wikipedia article: Mariana Islands
wikipedia article: Marianen
sh folder count: 4
note: shFolderCount: 4
NotationLong: D 015
broader: Australia and Oceania
subject of: about
gnd identifier: 4249309-2
scope note: bis 30.06.1919, dann unter Japanische Mandatländer in Ozeanien (D 18); Inselgruppe im Pazifik; umfasst die Nördlichen Marianen und Guam @de
notation: D15

Australia and Oceania
type: Concept
notation: D1
label: Australien und südpazifischer Inselraum @de
narrower: Mariana Islands

NotationLong
sub property of: notation
definition: EXPERIMENTAL: Notation with blanks and leading zeros for sortability.