Australia and Oceania
type: Concept
notation: D1
label: Australien und südpazifischer Inselraum @de
narrower: Nauru

Nauru
type: Concept
notation: D8
subject of: about
wikipedia article: Nauru
note: shFolderCount: 11
broader: Australia and Oceania
sh folder count: 11
scope note: 1888 von Deutschland annektiert. 1914 von australischen Truppen besetzt. Ab 1920 unter australischem Mandat. @de
gnd identifier: 111598-4
gnd identifier: 4122008-0
folders complete: Y
NotationLong: D 008
in scheme: geo

NotationLong
sub property of: notation
definition: EXPERIMENTAL: Notation with blanks and leading zeros for sortability.