Africa
type: Concept
notation: C1
label: Afrika @de
narrower: Upper Volta

Upper Volta
type: Concept
broader: Africa
scope note: Obervolta bis 16.11.1932, später Burkina Faso (C 034) @de
in scheme: geo
label: Haute Volta @de
subject of: about
gnd identifier: 4088707-8
NotationLong: C 032 (alt)
notation: C32(alt)

NotationLong
sub property of: notation
definition: EXPERIMENTAL: Notation with blanks and leading zeros for sortability.