NotationLong
sub property of: notation
definition: EXPERIMENTAL: Notation with blanks and leading zeros for sortability.

Guangdong
type: Concept
in scheme: geo
wikipedia article: Guangdong
NotationLong: B 114
notation: B114
folders complete: Y
label: Kwangtung @de
scope note: Guangzhou (auch Kanton), Provinz Guangdong (Kanton), VR China @de
subject of: about
gnd identifier: 4110406-7
sh folder count: 85
note: shFolderCount: 85
broader: Asia

Asia
type: Concept
notation: B1
label: Asien @de
narrower: Guangdong