NotationLong
sub property of: notation
definition: EXPERIMENTAL: Notation with blanks and leading zeros for sortability. @en

Sarawak
type: Concept
in scheme: geo
notation: B80a
broader: Asien
subject of: about
NotationLong: B 080a
scope note: Dieser größte ostmalaysische Bundesstaat liegt im nordwestlichen Teil der Insel Borneo
wikipedia article: Königreich Sarawak
wikipedia article: Raj of Sarawak
gnd identifier: 4051682-9

Asien
type: Concept
notation: B1
label: Asia @en
narrower: Sarawak