Sulawesi
type: Concept
scope note: Sulawesi, zwischen Borneo und Neuguinea am Äquator liegende, zu Indonesien gehörende Insel @de
preferred label: Celebes @de
in scheme: geo
notation: B76
broader: Asia
subject of: about
NotationLong: B 076
gnd identifier: 4069884-1

Asia
type: Concept
notation: B1
label: Asien @de
narrower: Sulawesi

NotationLong
sub property of: notation
definition: EXPERIMENTAL: Notation with blanks and leading zeros for sortability.