NotationLong
sub property of: notation
definition: EXPERIMENTAL: Notation with blanks and leading zeros for sortability. @en

Straits Settlements
type: Concept
wa folder count: 4
wikipedia article: Straits Settlements
note: waFolderCount: 4
note: shFolderCount: 2
sh folder count: 2
in scheme: geo
folders complete: F
subject of: about
broader: Asien
gnd identifier: 4472597-8
notation: B59
scope note: Singapur (ab 2.4.1946), Malacca,Penang, Singapur = Straits Settlements
NotationLong: B 059

Asien
type: Concept
notation: B1
label: Asia @en
narrower: Straits Settlements