South Caucasus
type: Concept
preferred label: Transkaukasien @de
broader: Asia
gnd identifier: 4060656-9
subject of: about
NotationLong: B 017c
scope note: ab 01.01.1923: Kaukasien B 16; bezeichnet den Teil Kaukasiens südlich der Hauptkette des Großen Kaukasus @de
notation: B17c
in scheme: geo

Asia
type: Concept
notation: B1
label: Asien @de
narrower: South Caucasus

NotationLong
sub property of: notation
definition: EXPERIMENTAL: Notation with blanks and leading zeros for sortability.