NotationLong
sub property of: notation
definition: EXPERIMENTAL: Notation with blanks and leading zeros for sortability.

Asia
type: Concept
notation: B1
label: Asien @de
narrower: Azerbaijan

Azerbaijan
type: Concept
gnd identifier: 4060656-9
gnd identifier: 4068887-2
preferred label: Aserbaidschan @de
broader: Asia
NotationLong: B 017a
in scheme: geo
subject of: about
scope note: bis 30.06.1931, dann Sowjetunion (Asiatischer Teil) B 010 @de
notation: B17a