Siberia
type: Concept
subject of: about
broader: Soviet Asia
label: Sibirien @de
gnd identifier: 4054780-2
note: waFolderCount: 2
in scheme: geo
wa folder count: 2
scope note: bis 30.06.1931, dann Sowjetunion (Asiatischer Teil) (B 10) @de
wikipedia article: Sibirien
wikipedia article: Siberia
notation: B11
NotationLong: B 011

Soviet Asia
type: Concept
notation: B10
label: Sowjetunion (Asiatischer Teil) @de
narrower: Siberia

NotationLong
sub property of: notation
definition: EXPERIMENTAL: Notation with blanks and leading zeros for sortability.