Western Asia
type: Concept
notation: B3
label: Vorderasien, Westasien @de
narrower: Levant

Levant
type: Concept
note: shFolderCount: 46
scope note: Länder des östlichen Mittelmeeres, eigentlich alle Länder, die östlich von Italien liegen, besonders das Küstengebiet von Kleinasien, Libanon, Syrien und Ägypten. @de
label: Levante @de
gnd identifier: 4196563-2
wikipedia article: Levant
wikipedia article: Levante
notation: A5
folders complete: Y
NotationLong: A 005
broader: Western Asia
geo category type: B
in scheme: geo
subject of: about
sh folder count: 46

NotationLong
sub property of: notation
definition: EXPERIMENTAL: Notation with blanks and leading zeros for sortability.