NotationLong
sub property of: notation
definition: EXPERIMENTAL: Notation with blanks and leading zeros for sortability.

Australia and Oceania
type: Concept
label: Australien und südpazifischer Inselraum @de
narrower: Mariana Islands
notation: D1

Mariana Islands
type: Concept
subject of: about
wikipedia article: Mariana Islands
wikipedia article: Marianen
label: Marianen @de
broader: Australia and Oceania
in scheme: geo
notation: D15
note: shFolderCount: 4
scope note: bis 30.06.1919, dann unter Japanische Mandatländer in Ozeanien (D 18); Inselgruppe im Pazifik; umfasst die Nördlichen Marianen und Guam @de
folders complete: Y
NotationLong: D 015
sh folder count: 4
gnd identifier: 4249309-2