NotationLong
sub property of: notation
definition: EXPERIMENTAL: Notation with blanks and leading zeros for sortability.

Australia and Oceania
type: Concept
label: Australien und südpazifischer Inselraum @de
narrower: Solomon Islands and Bismarck Archipelago
notation: D1

Solomon Islands and Bismarck Archipelago
type: Concept
subject of: about
label: Salomoninseln und Bismarck-Archipel @de
broader: Australia and Oceania
in scheme: geo
notation: D11
note: shFolderCount: 29
scope note: Bismarck Archipel, Neu-Hannover (Lavongai), Neu-Lauenburg, Neu-Pommern, Salomon Inseln i.G. @de
folders complete: Y
NotationLong: D 011
sh folder count: 29
gnd identifier: 4076974-4
gnd identifier: 4080417-3