NotationLong
sub property of: notation
definition: EXPERIMENTAL: Notation with blanks and leading zeros for sortability.

Africa
type: Concept
label: Afrika @de
narrower: British Somaliland
notation: C1

British Somaliland
type: Concept
subject of: about
wikipedia article: British Somaliland
wikipedia article: Britisch-Somaliland
label: Britisch-Somaliland @de
broader: Africa
in scheme: geo
notation: C121
note: waFolderCount: 2
scope note: nordwestliches Gebiet des heutigen Somalia, zusammen mit Italienisch-Somaliland das heutige Somalia @de
NotationLong: C 121
wa folder count: 2
gnd identifier: 4090132-4
gnd identifier: 4077509-4