NotationLong
sub property of: notation
definition: EXPERIMENTAL: Notation with blanks and leading zeros for sortability.

Africa
type: Concept
label: Afrika @de
narrower: Italian East Africa
notation: C1

Italian East Africa
type: Concept
subject of: about
wikipedia article: Italian East Africa
wikipedia article: Italienisch-Ostafrika
label: Italienisch-Ostafrika @de
broader: Africa
in scheme: geo
notation: C119
note: waFolderCount: 11
scope note: Italienisch Ostafrika (Eritrea und die äthiopische Provinz Tigre, 1936-1941), britische Verwaltung (1941-1952),Teil Äthipiens (1952- 1991), Eritrea (ab 1991 Übergangregierung, ab 1993 unabhängig) @de
NotationLong: C 119
wa folder count: 11
gnd identifier: 4015278-9
gnd identifier: 4208732-6
gnd identifier: 4666871-8