NotationLong
sub property of: notation
definition: EXPERIMENTAL: Notation with blanks and leading zeros for sortability.

Africa
type: Concept
label: Afrika @de
narrower: Zanzibar
notation: C1

Zanzibar
type: Concept
subject of: about
wikipedia article: Sansibar
wikipedia article: Zanzibar
label: Sansibar @de
broader: Africa
in scheme: geo
notation: C115
note: shFolderCount: 1
note: waFolderCount: 3
scope note: Inselgruppe vor der Ostküste Afrikas, britische Kolonie, ab 1963 unabhängig, zusammen mit Tanganyika ab 1964 zum Staat Tansania zusammengeschlossen @de
folders complete: F
NotationLong: C 115
sh folder count: 1
wa folder count: 3
gnd identifier: 4051641-6