NotationLong
sub property of: notation
definition: EXPERIMENTAL: Notation with blanks and leading zeros for sortability.

Africa
type: Concept
label: Afrika @de
narrower: Swaziland
notation: C1

Swaziland
type: Concept
subject of: about
wikipedia article: Eswatini
broader: Africa
in scheme: geo
notation: C97
note: waFolderCount: 2
note: shFolderCount: 1
scope note: Königreich, britisches Protektorat, ab 1968 unabhängig @de
folders complete: F
NotationLong: C 097
sh folder count: 1
wa folder count: 2
gnd identifier: 4058692-3