NotationLong
sub property of: notation
definition: EXPERIMENTAL: Notation with blanks and leading zeros for sortability.

Africa
type: Concept
label: Afrika @de
narrower: Portuguese Angola
notation: C1

Portuguese Angola
type: Concept
subject of: about
wikipedia article: Angola
label: Portugiesisch-Westafrika @de
broader: Africa
in scheme: geo
notation: C85
note: shFolderCount: 4
note: waFolderCount: 13
scope note: Portugiesisch-Westafrika (bis 1975), VR Angola, Republik Angola (ab 1992) @de
folders complete: N
NotationLong: C 085
sh folder count: 4
wa folder count: 13
gnd identifier: 4002050-2