NotationLong
sub property of: notation
definition: EXPERIMENTAL: Notation with blanks and leading zeros for sortability.

Africa
type: Concept
label: Afrika @de
narrower: Spanish Guinea
notation: C1

Spanish Guinea
type: Concept
subject of: about
wikipedia article: Spanish Guinea
wikipedia article: Spanisch-Guinea
label: Spanisch-Guinea @de
broader: Africa
in scheme: geo
notation: C70
note: shFolderCount: 43
note: waFolderCount: 3
scope note: Spanisch Guinea mit Fernando Po u. Dependenzen, Äquatorial-Guinea (ab 12.10.1968) @de
folders complete: Y
NotationLong: C 070
sh folder count: 43
wa folder count: 3
gnd identifier: 4068436-2