NotationLong
sub property of: notation
definition: EXPERIMENTAL: Notation with blanks and leading zeros for sortability.

Africa
type: Concept
label: Afrika @de
narrower: Upper Volta
notation: C1

Upper Volta
type: Concept
subject of: about
label: Haute Volta @de
broader: Africa
in scheme: geo
notation: C32(alt)
scope note: Obervolta bis 16.11.1932, später Burkina Faso (C 034) @de
NotationLong: C 032 (alt)
gnd identifier: 4088707-8