NotationLong
sub property of: notation
definition: EXPERIMENTAL: Notation with blanks and leading zeros for sortability.

Africa
type: Concept
label: Afrika @de
narrower: Italian Cyrenaica
notation: C1

Italian Cyrenaica
type: Concept
subject of: about
wikipedia article: Italian Cyrenaica
label: Cyrenaica @de
broader: Africa
in scheme: geo
notation: C16
note: waFolderCount: 1
scope note: (1912-1934), Landschaft im östlichen Libyen @de
NotationLong: C 016
wa folder count: 1
gnd identifier: 4010816-8