NotationLong
sub property of: notation
definition: EXPERIMENTAL: Notation with blanks and leading zeros for sortability.

Asia
type: Concept
label: Asien @de
narrower: Weihaiwei under British rule
notation: B1

Weihaiwei under British rule
type: Concept
subject of: about
wikipedia article: British Weihaiwei
label: Weihaiwei @de
broader: Asia
in scheme: geo
notation: B110
note: shFolderCount: 10
scope note: 1898 an England verpachtet, bis 30.9.1930, dann China (B 94), @de
folders complete: Y
NotationLong: B 110
sh folder count: 10
gnd identifier: 7580488-8