NotationLong
sub property of: notation
definition: EXPERIMENTAL: Notation with blanks and leading zeros for sortability.

Asia
type: Concept
label: Asien @de
narrower: Guangzhouwan
notation: B1

Guangzhouwan
type: Concept
subject of: about
wikipedia article: Französisch-Indochina
wikipedia article: French Indochina
label: Kuangtschouwan @de
broader: Asia
in scheme: geo
notation: B100
note: shFolderCount: 4
scope note: Gebiet in China, 1898 an Frankreich verpachtet @de
folders complete: Y
NotationLong: B 100
sh folder count: 4
gnd identifier: 115041-8
gnd identifier: 4771337-9