NotationLong
sub property of: notation
definition: EXPERIMENTAL: Notation with blanks and leading zeros for sortability.

Asia
type: Concept
label: Asien @de
narrower: Sabah
notation: B1

Sabah
type: Concept
subject of: about
wikipedia article: Sabah
broader: Asia
in scheme: geo
notation: B80c
note: shFolderCount: 1
scope note: Britisch Nordborneo, Sabah (ab 16.9.1963), der kleinere der beiden Teilstaaten von Malaysia auf der Pazifik-Insel Borneo @de
folders complete: F
NotationLong: B 080c
sh folder count: 1
gnd identifier: 4042495-9