NotationLong
sub property of: notation
definition: EXPERIMENTAL: Notation with blanks and leading zeros for sortability. @en

Asien
type: Concept
label: Asia @en
narrower: Sikkim
notation: B1

Sikkim
type: Concept
subject of: about
wikipedia article: Kingdom of Sikkim
wikipedia article: Königreich Sikkim
broader: Asien
in scheme: geo
notation: B44
scope note: Indischer Bundesstaat und ehemals unabhängiges Königreich
NotationLong: B 044
gnd identifier: 4054962-8