NotationLong
sub property of: notation
definition: EXPERIMENTAL: Notation with blanks and leading zeros for sortability.

Asia
type: Concept
label: Asien @de
narrower: Trucial States
notation: B1

Trucial States
type: Concept
subject of: about
wikipedia article: Vertragsoman
wikipedia article: Trucial States
label: Piratenküste @de
broader: Asia
in scheme: geo
notation: B37
scope note: Vertragsküste (Vereinigte Arabische Emirate ab 2.12.1971) @de
NotationLong: B 037
gnd identifier: 4002529-9
gnd identifier: 4062742-1
gnd identifier: 4075653-1