NotationLong
sub property of: notation
definition: EXPERIMENTAL: Notation with blanks and leading zeros for sortability.

Asia
type: Concept
label: Asien @de
narrower: Saudi Arabia
notation: B1

Saudi Arabia
type: Concept
subject of: about
wikipedia article: Saudi Arabia
wikipedia article: Saudi-Arabien
label: Saudi-Arabien @de
broader: Asia
in scheme: geo
notation: B32
scope note: Nadschd ist eine Landschaft und Provinz im Inneren Saudi-Arabiens, früher Saudi-arabisches Teilkönigreich, ehem Reich der Wahabiten. Siehe auch: Hedschas @de
NotationLong: B 032
gnd identifier: 4210617-5
gnd identifier: 4051788-3