NotationLong
sub property of: notation
definition: EXPERIMENTAL: Notation with blanks and leading zeros for sortability.

Asia
type: Concept
label: Asien @de
narrower: Hadhramaut
notation: B1

Hadhramaut
type: Concept
subject of: about
label: Hadramaut @de
broader: Asia
in scheme: geo
notation: B30
scope note: Region im Südosten der Republik Jemen @de
NotationLong: B 030
gnd identifier: 4022765-0
gnd identifier: 4073009-8