NotationLong
sub property of: notation
definition: EXPERIMENTAL: Notation with blanks and leading zeros for sortability.

Asia
type: Concept
label: Asien @de
narrower: 'Asir Region
notation: B1

'Asir Region
type: Concept
subject of: about
wikipedia article: Emirate of Asir
wikipedia article: Idrisidisches Emirat Asir
label: Asir @de
broader: Asia
in scheme: geo
notation: B28
note: waFolderCount: 1
scope note: Fürstentum bis ca. 1933, Südarabische Föderation (1963-1967), Südjemen (ab 1967) @de
NotationLong: B 028
wa folder count: 1
gnd identifier: 1026301653