NotationLong
sub property of: notation
definition: EXPERIMENTAL: Notation with blanks and leading zeros for sortability.

Asia
type: Concept
label: Asien @de
narrower: United Arab Emirates
notation: B1

United Arab Emirates
type: Concept
subject of: about
wikipedia article: United Arab Emirates
wikipedia article: Vereinigte Arabische Emirate
label: Vereinigte Arabische Emirate @de
broader: Asia
in scheme: geo
notation: B26
scope note: (einschl.: Vereinigte Arabische Republiken, Djebel Schammar Emirat) @de
NotationLong: B 026
gnd identifier: 4062742-1