NotationLong
sub property of: notation
definition: EXPERIMENTAL: Notation with blanks and leading zeros for sortability.

Asia
type: Concept
label: Asien @de
narrower: Azerbaijan
notation: B1

Azerbaijan
type: Concept
subject of: about
label: Aserbaidschan @de
broader: Asia
in scheme: geo
notation: B17a
scope note: bis 30.06.1931, dann Sowjetunion (Asiatischer Teil) B 010 @de
NotationLong: B 017a
gnd identifier: 4060656-9
gnd identifier: 4068887-2