NotationLong
sub property of: notation
definition: EXPERIMENTAL: Notation with blanks and leading zeros for sortability.

Asia
type: Concept
label: Asien @de
narrower: Caucasus
notation: B1

Caucasus
type: Concept
subject of: about
wikipedia article: Caucasus
wikipedia article: Kaukasien
label: Kaukasien @de
broader: Asia
editorial note: bis 30.06.1931, dann Sowjetunion (Asiatischer Teil) B 010 @de
in scheme: geo
notation: B16
note: waFolderCount: 5
scope note: Länder im Bereich u. mit Anteil am Kaukasus @de
NotationLong: B 016
wa folder count: 5
gnd identifier: 4448813-0