NotationLong
sub property of: notation
definition: EXPERIMENTAL: Notation with blanks and leading zeros for sortability.

Asia
type: Concept
label: Asien @de
narrower: East Asia
notation: B1

East Asia
type: Concept
subject of: about
wikipedia article: Ostasien
wikipedia article: East Asia
label: Ostasien @de
broader: Asia
in scheme: geo
notation: B6
note: waFolderCount: 2
note: shFolderCount: 1
scope note: Umfasst Südchina , die Große Ebene u. die Mandschurei sowie Korea, ferner die vorgelagerten Kurilen, Sachalin, die japanischen Inseln, Taiwan u. weiter kleine Inseln @de
folders complete: F
NotationLong: B 006
sh folder count: 1
wa folder count: 2
gnd identifier: 4075727-4