NotationLong
sub property of: notation
definition: EXPERIMENTAL: Notation with blanks and leading zeros for sortability.

Levant
type: Concept
label: Levante @de
broader: Western Asia
notation: A5

Asia
type: Concept
label: Asien @de
narrower: Western Asia
notation: B1

Western Asia
type: Concept
subject of: about
wikipedia article: Vorderasien
wikipedia article: West Asia
label: Vorderasien, Westasien @de
broader: Asia
in scheme: geo
narrower: Levant
notation: B3
scope note: Westasien (einschl.: Nahost, Vorderer Orient, Vorderasien, Near East, Middle East, Proche Orient. Ägypten, Arabien, Irak, Iran, Israel, Jordanien, Kuwait, Libanon, Syrien, Türkei) @de
NotationLong: B 003
gnd identifier: 4068878-1