NotationLong
sub property of: notation
definition: EXPERIMENTAL: Notation with blanks and leading zeros for sortability.

Europe
type: Concept
label: Europa @de
narrower: Southeastern Europe
notation: A1

Southeastern Europe
type: Concept
subject of: about
wikipedia article: Southeast Europe
wikipedia article: Südosteuropa
label: Südosteuropa @de
broader: Europe
in scheme: geo
narrower: Dalmatia
notation: A6
note: waFolderCount: 5
note: shFolderCount: 190
scope note: (einschl.: Balkan, Balitkum, Albanien, Bulgarien, Griechenland, Makedonien, Rumänien, Europäische Türkei, ehem. Jugoslawien, außer Slowenien)Umfasst die Südosteuropäische Halbinsel @de
folders complete: Y
geo category type: B
NotationLong: A 006
sh folder count: 190
wa folder count: 5
gnd identifier: 4058449-5

Dalmatia
type: Concept
label: Dalmatien @de
broader: Southeastern Europe
notation: A40g(A35)