NotationLong
sub property of: notation
definition: EXPERIMENTAL: Notation with blanks and leading zeros for sortability.

Levant
type: Concept
subject of: about
wikipedia article: Levant
wikipedia article: Levante
label: Levante @de
broader: Western Asia
in scheme: geo
notation: A5
note: shFolderCount: 46
scope note: Länder des östlichen Mittelmeeres, eigentlich alle Länder, die östlich von Italien liegen, besonders das Küstengebiet von Kleinasien, Libanon, Syrien und Ägypten. @de
folders complete: Y
geo category type: B
NotationLong: A 005
sh folder count: 46
gnd identifier: 4196563-2

Western Asia
type: Concept
label: Vorderasien, Westasien @de
narrower: Levant
notation: B3