NotationLong
sub property of: notation
definition: EXPERIMENTAL: Notation with blanks and leading zeros for sortability.

Europe
type: Concept
label: Europa @de
narrower: Central Europe
notation: A1

Central Europe
type: Concept
subject of: about
wikipedia article: Mitteleuropa
wikipedia article: Central Europe
label: Mitteleuropa @de
broader: Europe
in scheme: geo
notation: A2
note: shFolderCount: 20
note: waFolderCount: 4
scope note: (einschl.: Donauraum. Deutschland, Österreich, Polen, Schweiz, Slowakei, Slowenien, Tschechische Republik, Kroatien und Ungarn) @de
folders complete: Y
geo category type: A
NotationLong: A 002
sh folder count: 20
wa folder count: 4
gnd identifier: 4039677-0